BDBM6541 3-quinolinecarbonitrile deriv. 6a::4-[(2,4-dichloro-5-ethoxyphenyl)amino]-7-[(E)-2-(pyridin-4-yl)ethenyl]quinoline-3-carbonitrile
SMILES CCOc1cc(Nc2c(cnc3cc(\C=C\c4ccncc4)ccc23)C#N)c(Cl)cc1Cl
InChI Key InChIKey=OPBXEPZDIQZFNH-ONEGZZNKSA-N
Data  1 IC50
  Tab Delimited (TSV)   2D SDfile   Computed 3D by Vconf -m prep SDfile
Find this compound or compounds like it in BindingDB:
Activity Spreadsheet -- Enzyme Inhibition Constant Data from BindingDB
Found 1 hit for monomerid = 6541
TargetProto-oncogene tyrosine-protein kinase Src(Homo sapiens (Human))
Wyeth-Ayerst Research
LigandPNGBDBM6541(3-quinolinecarbonitrile deriv. 6a | 4-[(2,4-dichlo...)
Affinity DataIC50:  3.10E+3nM. Assay description: Kinase assays were performed using the europium/APC detection format (LANCE, Perkin Elmer). HTRF is based on the proximity of europium cryptate (dono...
In DepthDetails ArticlePubMed