BDBM6542 3-quinolinecarbonitrile deriv. 7a::4-{[(3,5-dichlorophenyl)methyl]amino}-7-[(E)-2-(pyridin-4-yl)ethenyl]quinoline-3-carbonitrile
SMILES Clc1cc(Cl)cc(CNc2c(cnc3cc(\C=C\c4ccncc4)ccc23)C#N)c1
InChI Key InChIKey=MZBGYQSMOFPJII-OWOJBTEDSA-N
Data  1 IC50
  Tab Delimited (TSV)   2D SDfile   Computed 3D by Vconf -m prep SDfile
Find this compound or compounds like it in BindingDB:
Activity Spreadsheet -- Enzyme Inhibition Constant Data from BindingDB
Found 1 hit for monomerid = 6542
TargetProto-oncogene tyrosine-protein kinase Src(Homo sapiens (Human))
Wyeth-Ayerst Research
LigandPNGBDBM6542(3-quinolinecarbonitrile deriv. 7a | 4-{[(3,5-dichl...)
Affinity DataIC50:  1.00E+3nM. Assay description: Kinase assays were performed using the europium/APC detection format (LANCE, Perkin Elmer). HTRF is based on the proximity of europium cryptate (dono...
Ligand InfoPC cidPC sid
In DepthDetails ArticlePubMed