BDBM6544 3-quinolinecarboxylate deriv. 12::ethyl 4-[(2,4-dichlorophenyl)amino]-7-[(E)-2-(pyridin-4-yl)ethenyl]quinoline-3-carboxylate
SMILES CCOC(=O)c1cnc2cc(\C=C\c3ccncc3)ccc2c1Nc1ccc(Cl)cc1Cl
InChI Key InChIKey=MCKKAYXLKYZVST-ONEGZZNKSA-N
Data  1 IC50
  Tab Delimited (TSV)   2D SDfile   Computed 3D by Vconf -m prep SDfile
Find this compound or compounds like it in BindingDB:
Activity Spreadsheet -- Enzyme Inhibition Constant Data from BindingDB
Found 1 hit for monomerid = 6544
TargetProto-oncogene tyrosine-protein kinase Src(Homo sapiens (Human))
Wyeth-Ayerst Research
LigandPNGBDBM6544(3-quinolinecarboxylate deriv. 12 | ethyl 4-[(2,4-d...)
Affinity DataIC50:  1.20E+4nM. Assay description: Kinase assays were performed using the europium/APC detection format (LANCE, Perkin Elmer). HTRF is based on the proximity of europium cryptate (dono...
In DepthDetails ArticlePubMed