BDBM6548 3-quinolinecarbonitrile deriv. 16::4-[(2,4-dichloro-5-methoxyphenyl)amino]-7-[(E)-2-(4-phenylphenyl)ethenyl]quinoline-3-carbonitrile
SMILES COc1cc(Nc2c(cnc3cc(\C=C\c4ccc(cc4)-c4ccccc4)ccc23)C#N)c(Cl)cc1Cl
InChI Key InChIKey=NWUXQHLXYBMHLB-BQYQJAHWSA-N
Data  1 IC50
  Tab Delimited (TSV)   2D SDfile   Computed 3D by Vconf -m prep SDfile
Find this compound or compounds like it in BindingDB:
Activity Spreadsheet -- Enzyme Inhibition Constant Data from BindingDB
Found 1 hit for monomerid = 6548
TargetProto-oncogene tyrosine-protein kinase Src(Homo sapiens (Human))
Wyeth-Ayerst Research
LigandPNGBDBM6548(3-quinolinecarbonitrile deriv. 16 | 4-[(2,4-dichlo...)
Affinity DataIC50:  2.30E+3nM. Assay description: Kinase assays were performed using the europium/APC detection format (LANCE, Perkin Elmer). HTRF is based on the proximity of europium cryptate (dono...
In DepthDetails ArticlePubMed