BDBM668 BMS-186318 analog 5::[1S-[1R*,2S*(2S*,3R*)]]-[3-[[3-[[(1,1-Dimethylethoxy)-carbonyl]amino]-2-hydroxy-4-(3-hydroxyphenyl)butyl]-amino]-2-hydroxy-1-(phenylmethyl)propyl]carbamic Acid, 1,1-Dimethylethyl Ester::tert-butyl N-[(2S,3R)-4-{[(2R,3S)-3-{[(tert-butoxy)carbonyl]amino}-2-hydroxy-4-(3-hydroxyphenyl)butyl]amino}-3-hydroxy-1-phenylbutan-2-yl]carbamate
SMILES CC(C)(C)OC(=O)N[C@@H](Cc1ccccc1)[C@H](O)CNC[C@@H](O)[C@H](Cc1cccc(O)c1)NC(=O)OC(C)(C)C
InChI Key InChIKey=KOHJMQXAUBCBFT-QEGGNFSNSA-N
Data  1 IC50
  Tab Delimited (TSV)   2D SDfile   Computed 3D by Vconf -m prep SDfile
Find this compound or compounds like it in BindingDB:
Activity Spreadsheet -- Enzyme Inhibition Constant Data from BindingDB
Found 1 hit for monomerid = 668
TargetDimer of Gag-Pol polyprotein [489-587](Human immunodeficiency virus type 1)
Bristol-Myers Squibb
LigandPNGBDBM668(BMS-186318 analog 5 | [1S-[1R*,2S*(2S*,3R*)]]-[3-[...)
Affinity DataIC50:  200nMpH: 5.5 T: 2°C. Assay description: IC50 values are determined by inhibition of the cleavage of the peptidic substrate [V-S-Q-N-(beta-naphthylalanine)-P-I-V]. The IC50 value represents ...
In DepthDetails ArticlePubMed