BDBM67092 (2S)-2-amino-N-[(3S,10R,13S,17S)-3-hydroxy-10,13-dimethyl-2,3,4,7,8,9,11,12,14,15,16,17-dodecahydro-1H-cyclopenta[a]phenanthren-17-yl]-3,3-dimethyl-butyramide::(2S)-2-amino-N-[(3S,10R,13S,17S)-3-hydroxy-10,13-dimethyl-2,3,4,7,8,9,11,12,14,15,16,17-dodecahydro-1H-cyclopenta[a]phenanthren-17-yl]-3,3-dimethylbutanamide::(2S)-2-azanyl-N-[(3S,10R,13S,17S)-10,13-dimethyl-3-oxidanyl-2,3,4,7,8,9,11,12,14,15,16,17-dodecahydro-1H-cyclopenta[a]phenanthren-17-yl]-3,3-dimethyl-butanamide::MLS002554389::SMR001475670::cid_44263724
SMILES CC(C)(C)[C@H](N)C(=O)N[C@H]1CCC2C3CC=C4C[C@@H](O)CC[C@]4(C)C3CC[C@]12C
InChI Key InChIKey=DKQUQODYLFKBLG-HNNQZBGKSA-N
Data  2 IC50  1 EC50
  Tab Delimited (TSV)   2D SDfile   Computed 3D by Vconf -m prep SDfile
Find this compound or compounds like it in BindingDB:
Activity Spreadsheet -- Enzyme Inhibition Constant Data from BindingDB
Found 3 hits for monomerid = 67092
TargetBcl-2-like protein 11(Homo sapiens (Human))
Broad Institute
Curated by PubChem BioAssay
LigandPNGBDBM67092((2S)-2-amino-N-[(3S,10R,13S,17S)-3-hydroxy-10,13-d...)
Affinity DataEC50: >3.50E+5nM. Assay description: Keywords: apoptosis, BH3 domain, Bcl2-A1, BIM, caspase, cancer Primary Collaborator: Todd Golub, Broad Institute, golub@broadinstitute.org Assay Over...
In DepthDetails PCBioAssay
TargetReceptor-interacting serine/threonine-protein kinase 2(Homo sapiens (Human))
The Scripps Research Institute Molecular Screening Center
Curated by PubChem BioAssay
LigandPNGBDBM67092((2S)-2-amino-N-[(3S,10R,13S,17S)-3-hydroxy-10,13-d...)
Affinity DataIC50:  1.77E+4nM
In DepthDetails PCBioAssay
TargetBeta-lactamase(Pseudomonas aeruginosa)
The Scripps Research Institute Molecular Screening Center
Curated by PubChem BioAssay
LigandPNGBDBM67092((2S)-2-amino-N-[(3S,10R,13S,17S)-3-hydroxy-10,13-d...)
Affinity DataIC50:  1.95E+4nM
In DepthDetails PCBioAssay