BDBM67298 MLS000777130::N-[(5E)-5-(2-hydroxy-5-nitro-benzylidene)-4-keto-2-thiazolin-2-yl]-1-phenyl-methanesulfonamide::N-[(5E)-5-[(2-hydroxy-5-nitrophenyl)methylidene]-4-oxo-1,3-thiazol-2-yl]-1-phenylmethanesulfonamide::N-[(5E)-5-[(2-hydroxy-5-nitrophenyl)methylidene]-4-oxo-2-thiazolyl]-1-phenylmethanesulfonamide::N-[(5E)-5-[(5-nitro-2-oxidanyl-phenyl)methylidene]-4-oxidanylidene-1,3-thiazol-2-yl]-1-phenyl-methanesulfonamide::N-[5-[1-(2-Hydroxy-5-nitro-phenyl)-meth-(E)-ylidene]-4-oxo-thiazolidin-(2E)-ylidene]-C-phenyl-methanes ulfonamide::SMR000413526::cid_1893759
SMILES Oc1ccc(cc1\C=C1\SC(NS(=O)(=O)Cc2ccccc2)=NC1=O)[N+]([O-])=O
InChI Key InChIKey=RYFDVUANILCDLL-OQLLNIDSSA-N
Data  4 IC50
  Tab Delimited (TSV)   2D SDfile   Computed 3D by Vconf -m prep SDfile
Find this compound or compounds like it in BindingDB:
Activity Spreadsheet -- Enzyme Inhibition Constant Data from BindingDB
Found 4 hits for monomerid = 67298
TargetApelin receptor(Homo sapiens (Human))
Sanford-Burnham Center For Chemical Genomics
Curated by PubChem BioAssay
LigandPNGBDBM67298(MLS000777130 | N-[(5E)-5-(2-hydroxy-5-nitro-benzyl...)
Affinity DataIC50:  2.85E+4nM. Assay description: Data Source: Sanford-Burnham Center for Chemical Genomics (SBCCG) Source Affiliation: Sanford- Sanford-Burnham Medical Research Institute(SBMRI, San...
In DepthDetails PCBioAssay
TargetBeta-lactamase(Pseudomonas aeruginosa)
The Scripps Research Institute Molecular Screening Center
Curated by PubChem BioAssay
LigandPNGBDBM67298(MLS000777130 | N-[(5E)-5-(2-hydroxy-5-nitro-benzyl...)
Affinity DataIC50:  4.37E+3nM. Assay description: Source (MLPCN Center Name): The Scripps Research Institute Molecular Screening Center (SRIMSC) Affiliation: The Scripps Research Institute, TSRI Assa...
In DepthDetails PCBioAssay
TargetToll-like receptor 9(Homo sapiens (Human))
The Scripps Research Institute Molecular Screening Center
Curated by PubChem BioAssay
LigandPNGBDBM67298(MLS000777130 | N-[(5E)-5-(2-hydroxy-5-nitro-benzyl...)
Affinity DataIC50:  5.12E+3nM. Assay description: Source (MLPCN Center Name): The Scripps Research Institute Molecular Screening Center (SRIMSC) Affiliation: The Scripps Research Institute, TSRI Assa...
In DepthDetails PCBioAssay
TargetType-1 angiotensin II receptor(Homo sapiens (Human))
Burnham Center For Chemical Genomics
Curated by PubChem BioAssay
LigandPNGBDBM67298(MLS000777130 | N-[(5E)-5-(2-hydroxy-5-nitro-benzyl...)
Affinity DataIC50:  3.99E+4nM. Assay description: Data Source: Sanford-Burnham Center for Chemical Genomics (SBCCG) Source Affiliation: Sanford-Burnham Medical Research Institute(SBMRI, San Diego, C...
In DepthDetails PCBioAssay