BDBM68238 Thiazolidinone core, 20
SMILES OC(=O)C(Cc1ccc(O)cc1)N1C(=S)S\C(C1=O)=C1/C(=O)Nc2ccccc12
InChI Key InChIKey=RPZSIFSUKPVJEW-NXVVXOECSA-N
Data  2 Kd
  Tab Delimited (TSV)   2D SDfile   Computed 3D by Vconf -m prep SDfile
Find this compound or compounds like it in BindingDB:
Activity Spreadsheet -- Enzyme Inhibition Constant Data from BindingDB
Found 2 hits for monomerid = 68238
TargetUDP-galactopyranose mutase(Mycobacterium tuberculosis H37Rv)
University of Wisconsin-Madison
LigandPNGBDBM68238(Thiazolidinone core, 20)
Affinity DataKd: >3.30E+4nM. Assay description: To access the ability of compounds to inhibit the catalytic activity of UGM, an HPLC assay was employed. Inhibition constants were determined by mon...
In DepthDetails ArticlePubMed
TargetUDP-galactopyranose mutase(Klebsiella pneumoniae)
University of Wisconsin-Madison
LigandPNGBDBM68238(Thiazolidinone core, 20)
Affinity DataKd:  1.41E+4nM. Assay description: To access the ability of compounds to inhibit the catalytic activity of UGM, an HPLC assay was employed. Inhibition constants were determined by mon...
In DepthDetails ArticlePubMed