BDBM69653 CHEMBL553677::MLS001208244::N,2-diphenyl-4-quinazolinamine::N,2-diphenylquinazolin-4-amine::Phenyl-(2-phenyl-quinazolin-4-yl)-amine::SMR000515838::cid_698960::phenyl-(2-phenylquinazolin-4-yl)amine
SMILES N(c1ccccc1)c1nc(nc2ccccc12)-c1ccccc1
InChI Key InChIKey=CMVDRFFMSYMSRT-UHFFFAOYSA-N
Data  6 IC50  2 EC50
  Tab Delimited (TSV)   2D SDfile   Computed 3D by Vconf -m prep SDfile
Find this compound or compounds like it in BindingDB:
Activity Spreadsheet -- Enzyme Inhibition Constant Data from BindingDB
Found 8 hits for monomerid = 69653
TargetGlycogen synthase kinase-3 beta(Homo sapiens (Human))
Broad Institute
Curated by PubChem BioAssay
LigandPNGBDBM69653(CHEMBL553677 | MLS001208244 | N,2-diphenyl-4-quina...)
Affinity DataEC50: >3.00E+5nM. Assay description: Keywords: GSK3beta, dose response, kinase, inhibition, HTS Assay Overview: The glycogen synthase kinase-3 beta (GSK-3b) is a known master regulator f...
In DepthDetails PCBioAssay
TargetcGMP-specific 3',5'-cyclic phosphodiesterase(Homo sapiens (Human))
Biofor
Curated by ChEMBL
LigandPNGBDBM69653(CHEMBL553677 | MLS001208244 | N,2-diphenyl-4-quina...)
Affinity DataIC50:  5.60E+3nM. Assay description: Inhibitory activity against phosphodiesterase 5 from human platelets
In DepthDetails ArticlePubMed
TargetBroad substrate specificity ATP-binding cassette transporter ABCG2(Homo sapiens (Human))
University Of Bonn
Curated by ChEMBL
LigandPNGBDBM69653(CHEMBL553677 | MLS001208244 | N,2-diphenyl-4-quina...)
Affinity DataIC50:  2.57E+3nM. Assay description: Inhibition of human BCRP expressed in MDCK2 cells preincubated for 30 mins prior to Hoechst 33342 addition measured every 60 secs up to 120 mins by H...
In DepthDetails ArticlePubMed
TargetBroad substrate specificity ATP-binding cassette transporter ABCG2(Homo sapiens (Human))
University Of Bonn
Curated by ChEMBL
LigandPNGBDBM69653(CHEMBL553677 | MLS001208244 | N,2-diphenyl-4-quina...)
Affinity DataIC50:  882nM. Assay description: Inhibition of GFP-fused human ABCG2 expressed in MDCK2 cells assessed as Hoechst 33342 accumulation preincubated for 30 mins followed by Hoechst 3334...
In DepthDetails ArticlePubMed
TargetBroad substrate specificity ATP-binding cassette transporter ABCG2(Homo sapiens (Human))
University Of Bonn
Curated by ChEMBL
LigandPNGBDBM69653(CHEMBL553677 | MLS001208244 | N,2-diphenyl-4-quina...)
Affinity DataEC50:  72nM. Assay description: Activation of recombinant human ABCG2 ATPase activity expressed in baculovirus infected High five insect cell membranes after 20 mins by ascorbic aci...
In DepthDetails ArticlePubMed
TargetBroad substrate specificity ATP-binding cassette transporter ABCG2(Homo sapiens (Human))
University Of Bonn
Curated by ChEMBL
LigandPNGBDBM69653(CHEMBL553677 | MLS001208244 | N,2-diphenyl-4-quina...)
Affinity DataIC50:  882nM. Assay description: Inhibition of c-terminal GFP-tagged human ABCG2 expressed in MDCK2 cells preincubated for 30 mins before Hoechst 33342 addition by Hoechst 33342 accu...
In DepthDetails ArticlePubMed
TargetBroad substrate specificity ATP-binding cassette transporter ABCG2(Homo sapiens (Human))
University Of Bonn
Curated by ChEMBL
LigandPNGBDBM69653(CHEMBL553677 | MLS001208244 | N,2-diphenyl-4-quina...)
Affinity DataIC50:  882nM. Assay description: Activation of recombinant human ABCG2 ATPase activity expressed in baculovirus infected High five insect cell membranes after 20 mins by ascorbic aci...
In DepthDetails ArticlePubMed
TargetBroad substrate specificity ATP-binding cassette transporter ABCG2(Homo sapiens (Human))
University Of Bonn
Curated by ChEMBL
LigandPNGBDBM69653(CHEMBL553677 | MLS001208244 | N,2-diphenyl-4-quina...)
Affinity DataIC50:  882nM. Assay description: Inhibition of recombinant human GFP-fused ABCG2 expressed in MDCK2 cells assessed as reduction in Hoechst 33342 efflux preincubated for 30 mins follo...
In DepthDetails ArticlePubMed