BDBM70719 US9695197, 1
SMILES CCNC1=N[C@H]2[C@@H](O1)S[C@H](CO)[C@@H](O)[C@@H]2O
InChI Key InChIKey=NDWIUOZTFLIGRW-PVFLNQBWSA-N
Data  1 KI
  Tab Delimited (TSV)   2D SDfile   Computed 3D by Vconf -m prep SDfile
Find this compound or compounds like it in BindingDB:
Activity Spreadsheet -- Enzyme Inhibition Constant Data from BindingDB
Found 1 hit for monomerid = 70719
TargetProtein O-GlcNAcase(Homo sapiens (Human))
Alectos Therapeutics
US Patent
LigandPNGBDBM70719(US9695197, 1)
Affinity DataKi:  3nM ΔG°:  -11.6kcal/molepH: 7.0 T: 2°C. Assay description: Enzymatic reactions were carried out in a reaction containing 50 mM NaH2PO4, 100 mM NaCl and 0.1% BSA (pH 7.0) using 2 mM 4-Methylumbelliferyl N-acet...
In DepthDetails US Patent