BDBM7090 N-(1H-1,3-benzodiazol-2-yl)-3-{[(4R,5S,6S,7R)-3-{[3-(1H-1,3-benzodiazol-2-ylcarbamoyl)phenyl]methyl}-7-benzyl-5,6-dihydroxy-4-(2-methylpropyl)-2-oxo-1,3-diazepan-1-yl]methyl}benzamide::SD146 Analog 11
SMILES CC(C)C[C@@H]1[C@H](O)[C@@H](O)[C@@H](Cc2ccccc2)N(Cc2cccc(c2)C(=O)Nc2nc3ccccc3[nH]2)C(=O)N1Cc1cccc(c1)C(=O)Nc1nc2ccccc2[nH]1
InChI Key InChIKey=QCBGCIMPJCAVDQ-BHTPUMDESA-N
Data  1 KI
  Tab Delimited (TSV)   2D SDfile   Computed 3D by Vconf -m prep SDfile
Find this compound or compounds like it in BindingDB:
Activity Spreadsheet -- Enzyme Inhibition Constant Data from BindingDB
Found 1 hit for monomerid = 7090
TargetDimer of Gag-Pol polyprotein [489-587](Human immunodeficiency virus type 1)
Dupont Pharmaceuticals
LigandPNGBDBM7090(N-(1H-1,3-benzodiazol-2-yl)-3-{[(4R,5S,6S,7R)-3-{[...)
Affinity DataKi:  0.0380nM ΔG°:  -14.8kcal/molepH: 5.5 T: 2°C. Assay description: Inhibition of HIV protease was measured by assay of the cleavage of a fluorescent peptide substrate. The fluorescent product (2-aminobenzoyl-Ala-Thr-...
In DepthDetails ArticlePubMed