BDBM7103 1-(4-{1-[(5-cyclopropyl-1H-pyrazol-3-yl)carbamoyl]ethyl}phenyl)-2-oxopyrrolidine-3-carboxamide::1-(4-{2-[(5-Cyclopropyl-1H-pyrazol-3-yl)amino]-1-methyl-2-oxoethyl}phenyl)-2-oxopyrrolidine-3-carboxamide::3-Aminopyrazole deriv. 15
SMILES CC(C(=O)Nc1cc(n[nH]1)C1CC1)c1ccc(cc1)N1CCC(C(N)=O)C1=O
InChI Key InChIKey=PQTPLILJDUSKCC-UHFFFAOYSA-N
Data  1 IC50
  Tab Delimited (TSV)   2D SDfile   Computed 3D by Vconf -m prep SDfile
Find this compound or compounds like it in BindingDB:
Activity Spreadsheet -- Enzyme Inhibition Constant Data from BindingDB
Found 1 hit for monomerid = 7103
TargetCyclin-A2/Cyclin-dependent kinase 2(Homo sapiens (Human))
Nerviano Medical Sciences
LigandPNGBDBM7103(1-(4-{1-[(5-cyclopropyl-1H-pyrazol-3-yl)carbamoyl]...)
Affinity DataIC50:  20nMpH: 7.4 T: 2°C. Assay description: The biochemical activity of compounds was determined by incubation with specific enzymes and substrates in the presence ATP/[gamma-33P] ATP. After in...
In DepthDetails ArticlePubMed