BDBM71100 5-tert-butyl-N'-(2-chloranylethanoyl)-4,5,6,7-tetrahydro-1-benzothiophene-2-carbohydrazide::5-tert-butyl-N'-(2-chloro-1-oxoethyl)-4,5,6,7-tetrahydro-1-benzothiophene-2-carbohydrazide::5-tert-butyl-N'-(2-chloroacetyl)-4,5,6,7-tetrahydro-1-benzothiophene-2-carbohydrazide::5-tert-butyl-N'-(2-chloroacetyl)-4,5,6,7-tetrahydrobenzothiophene-2-carbohydrazide::MLS000770130::SMR000343593::cid_4961630
SMILES CC(C)(C)C1CCc2sc(cc2C1)C(=O)NNC(=O)CCl
InChI Key InChIKey=JOKIKXBTFOWSCI-UHFFFAOYSA-N
Data  1 IC50
  Tab Delimited (TSV)   2D SDfile   Computed 3D by Vconf -m prep SDfile
Find this compound or compounds like it in BindingDB:
Activity Spreadsheet -- Enzyme Inhibition Constant Data from BindingDB
Found 1 hit for monomerid = 71100
TargetProtein RecA(Mycobacterium tuberculosis H37Rv)
Southern Research Specialized Biocontainment Screening Center
Curated by PubChem BioAssay
LigandPNGBDBM71100(5-tert-butyl-N'-(2-chloranylethanoyl)-4,5,6,7-tetr...)
Affinity DataIC50:  6.29E+3nM. Assay description: Southern Research's Specialized Biocontainment Screening Center (SRSBSC) Southern Research Institute (Birmingham, Alabama) NIH Molecular Librarie...
In DepthDetails PCBioAssay