BDBM7112 3-Aminopyrazole deriv. 25::N-(5-cyclopropyl-1H-pyrazol-3-yl)-2-[4-(2,4-dioxoimidazolidin-1-yl)phenyl]propanamide
SMILES CC(C(=O)Nc1cc(n[nH]1)C1CC1)c1ccc(cc1)-n1cc(O)[nH]c1=O
InChI Key InChIKey=BOTKWNMXPRFXFY-UHFFFAOYSA-N
Data  1 IC50
  Tab Delimited (TSV)   2D SDfile   Computed 3D by Vconf -m prep SDfile
Find this compound or compounds like it in BindingDB:
Activity Spreadsheet -- Enzyme Inhibition Constant Data from BindingDB
Found 1 hit for monomerid = 7112
TargetCyclin-A2/Cyclin-dependent kinase 2(Homo sapiens (Human))
Nerviano Medical Sciences
LigandPNGBDBM7112(3-Aminopyrazole deriv. 25 | N-(5-cyclopropyl-1H-py...)
Affinity DataIC50:  17nM. Assay description: The biochemical activity of compounds was determined by incubation with specific enzymes and substrates in the presence ATP/[gamma-33P] ATP. After in...
In DepthDetails ArticlePubMed