BDBM7114 3-Aminopyrazole deriv. 27::N-(5-Cyclopropyl-1H-pyrazol-3-yl)-2-[4-(2-oxo-2,3-dihydro-1H-imidazol-1-yl)phenyl]propanamide
SMILES CC(C(=O)Nc1cc(n[nH]1)C1CC1)c1ccc(cc1)-n1cc[nH]c1=O
InChI Key InChIKey=IOOBSCBCJCFBKU-UHFFFAOYSA-N
Data  1 IC50
PDB links: 1 PDB ID matches this monomer.
  Tab Delimited (TSV)   2D SDfile   Computed 3D by Vconf -m prep SDfile
Find this compound or compounds like it in BindingDB:
Activity Spreadsheet -- Enzyme Inhibition Constant Data from BindingDB
Found 1 hit for monomerid = 7114
TargetCyclin-A2/Cyclin-dependent kinase 2(Homo sapiens (Human))
Nerviano Medical Sciences
LigandPNGBDBM7114(3-Aminopyrazole deriv. 27 | N-(5-Cyclopropyl-1H-py...)
Affinity DataIC50:  11nM. Assay description: The biochemical activity of compounds was determined by incubation with specific enzymes and substrates in the presence ATP/[gamma-33P] ATP. After in...