BDBM72352 1-benzoyl-5-hydroxy-5-(4-methylphenyl)-4H-pyrazole-3-carboxylic acid ethyl ester::1-benzoyl-5-hydroxy-5-(p-tolyl)-2-pyrazoline-3-carboxylic acid ethyl ester::MLS000700096::SMR000226333::cid_4343946::ethyl 1-benzoyl-5-hydroxy-5-(4-methylphenyl)-4,5-dihydro-1H-pyrazole-3-carboxylate::ethyl 1-benzoyl-5-hydroxy-5-(4-methylphenyl)-4H-pyrazole-3-carboxylate::ethyl 5-(4-methylphenyl)-5-oxidanyl-1-(phenylcarbonyl)-4H-pyrazole-3-carboxylate
SMILES CCOC(=O)C1=NN(C(=O)c2ccccc2)C(O)(C1)c1ccc(C)cc1
InChI Key InChIKey=ABQRHGHOVQWKHE-UHFFFAOYSA-N
Data  2 EC50
  Tab Delimited (TSV)   2D SDfile   Computed 3D by Vconf -m prep SDfile
Find this compound or compounds like it in BindingDB:
Activity Spreadsheet -- Enzyme Inhibition Constant Data from BindingDB
Found 2 hits for monomerid = 72352
TargetCorticotropin-releasing factor-binding protein(Homo sapiens (Human))
Burnham Center For Chemical Genomics
Curated by PubChem BioAssay
LigandPNGBDBM72352(1-benzoyl-5-hydroxy-5-(4-methylphenyl)-4H-pyrazole...)
Affinity DataEC50:  1.35E+4nM. Assay description: Data Source: Sanford-Burnham Center for Chemical Genomics (SBCCG) Source Affiliation: Sanford-Burnham Medical Research Institute (SBMRI, San Diego, C...
In DepthDetails PCBioAssay
TargetHeat shock factor protein 1(Mus musculus)
Broad Institute
Curated by PubChem BioAssay
LigandPNGBDBM72352(1-benzoyl-5-hydroxy-5-(4-methylphenyl)-4H-pyrazole...)
Affinity DataEC50: >2.60E+5nM. Assay description: Keywords: Heat Shock Factor-1 (HSF-1), Stress Response, MG132, NIH3T3, Luminescence Assay Overview: Confirmation testing of small molecules identifie...
In DepthDetails PCBioAssay