BDBM7427 (2 Z,3 E)-6-Bromo-5-nitroindirubin-3 -oxime::6-Bromo-5-nitroindirubin-3 -oxime::6-bromo-3-[(2Z,3E)-3-(hydroxyimino)-2,3-dihydro-1H-indol-2-ylidene]-5-nitro-2,3-dihydro-1H-indol-2-one::indirubin deriv. 7g
SMILES [O-][N+](=O)c1cc2[c-](-c3[nH]c4ccccc4c3N=[OH+])c(=O)[nH]c2cc1Br
InChI Key InChIKey=QAVXMZUMOXKXGN-UHFFFAOYSA-O
Data  3 IC50
  Tab Delimited (TSV)   2D SDfile   Computed 3D by Vconf -m prep SDfile
Find this compound or compounds like it in BindingDB:
Activity Spreadsheet -- Enzyme Inhibition Constant Data from BindingDB
Found 3 hits for monomerid = 7427
TargetCyclin-dependent kinase 5 activator 1 [99-307](Homo sapiens (Human))
University of Athens
LigandPNGBDBM7427((2 Z,3 E)-6-Bromo-5-nitroindirubin-3 -oxime | 6-Br...)
Affinity DataIC50:  150nMT: 2°C. Assay description: Kinase activities were assayed in buffers containing substrate, enzyme, and inhibitor at 30 °C in the presence of 15 uM ATP/ [gamma-32P] ATP. 32...
In DepthDetails ArticlePubMed
TargetCyclin-dependent kinase 1/G2/mitotic-specific cyclin-B(Marthasterias glacialis (starfish))
University of Athens
LigandPNGBDBM7427((2 Z,3 E)-6-Bromo-5-nitroindirubin-3 -oxime | 6-Br...)
Affinity DataIC50:  1.20E+4nMT: 2°C. Assay description: Kinase activities were assayed in buffers containing substrate, enzyme, and inhibitor at 30 °C in the presence of 15 uM ATP/ [gamma-32P] ATP. 32...
In DepthDetails ArticlePubMed
TargetGlycogen synthase kinase-3 beta(Porcine)
University of Athens
LigandPNGBDBM7427((2 Z,3 E)-6-Bromo-5-nitroindirubin-3 -oxime | 6-Br...)
Affinity DataIC50:  7nMT: 2°C. Assay description: Kinase activities were assayed in buffers containing substrate, enzyme, and inhibitor at 30 °C in the presence of 15 uM ATP/ [gamma-32P] ATP. 32...
In DepthDetails ArticlePubMed