BDBM75713 (2E)-7-(diethylamino)-2-(isonicotinoylhydrazono)-2H-chromene-3-carboxamide::MLS000720220::N-[[3-aminocarbonyl-7-(diethylamino)chromen-2-ylidene]amino]pyridine-4-carboxamide::N-[[3-carbamoyl-7-(diethylamino)-1-benzopyran-2-ylidene]amino]-4-pyridinecarboxamide::N-[[3-carbamoyl-7-(diethylamino)chromen-2-ylidene]amino]isonicotinamide::N-[[3-carbamoyl-7-(diethylamino)chromen-2-ylidene]amino]pyridine-4-carboxamide::SMR000304749::cid_4646908
SMILES CCN(CC)c1ccc2cc(C(N)=O)c(=NNC(=O)c3ccncc3)oc2c1
InChI Key InChIKey=PXJWYMYEBFOTLA-UHFFFAOYSA-N
Data  2 EC50
  Tab Delimited (TSV)   2D SDfile   Computed 3D by Vconf -m prep SDfile
Find this compound or compounds like it in BindingDB:
Activity Spreadsheet -- Enzyme Inhibition Constant Data from BindingDB
Found 2 hits for monomerid = 75713
TargetOxytocin receptor(Homo sapiens (Human))
The Scripps Research Institute Molecular Screening Center
Curated by PubChem BioAssay
LigandPNGBDBM75713((2E)-7-(diethylamino)-2-(isonicotinoylhydrazono)-2...)
Affinity DataEC50:  2.18E+4nM. Assay description: Source (MLPCN Center Name): The Scripps Research Institute Molecular Screening Center (SRIMSC) Center Affiliation: The Scripps Research Institute (TS...
In DepthDetails PCBioAssay
TargetVasopressin V1a receptor(Homo sapiens (Human))
The Scripps Research Institute Molecular Screening Center
Curated by PubChem BioAssay
LigandPNGBDBM75713((2E)-7-(diethylamino)-2-(isonicotinoylhydrazono)-2...)
Affinity DataEC50:  1.86E+4nM. Assay description: Source (MLPCN Center Name): The Scripps Research Institute Molecular Screening Center (SRIMSC) Center Affiliation: The Scripps Research Institute (TS...
In DepthDetails PCBioAssay