BDBM76172 2-[(5Z)-5-[[5-(1,3-benzothiazol-2-yl)-2-furanyl]methylidene]-4-oxo-2-sulfanylidene-3-thiazolidinyl]butanedioic acid::2-[(5Z)-5-[[5-(1,3-benzothiazol-2-yl)-2-furyl]methylene]-4-keto-2-thioxo-thiazolidin-3-yl]succinic acid::2-[(5Z)-5-[[5-(1,3-benzothiazol-2-yl)furan-2-yl]methylidene]-4-oxidanylidene-2-sulfanylidene-1,3-thiazolidin-3-yl]butanedioic acid::2-[(5Z)-5-[[5-(1,3-benzothiazol-2-yl)furan-2-yl]methylidene]-4-oxo-2-sulfanylidene-1,3-thiazolidin-3-yl]butanedioic acid::2-{5-[1-(5-Benzothiazol-2-yl-furan-2-yl)-meth-(Z)-ylidene]-4-oxo-2-thioxo-thiazolidin-3-yl}-succinic acid::MLS000551706::SMR000145631::cid_5952293
SMILES OC(=O)CC(N1C(=S)S\C(=C/c2ccc(o2)-c2nc3ccccc3s2)C1=O)C(O)=O
InChI Key InChIKey=ZUTDAWTWLZTAEP-AUWJEWJLSA-N
Data  3 IC50  2 EC50
  Tab Delimited (TSV)   2D SDfile   Computed 3D by Vconf -m prep SDfile
Find this compound or compounds like it in BindingDB:
Activity Spreadsheet -- Enzyme Inhibition Constant Data from BindingDB
Found 5 hits for monomerid = 76172
TargetIntestinal-type alkaline phosphatase(Homo sapiens (Human))
Burnham Center For Chemical Genomics
Curated by PubChem BioAssay
LigandPNGBDBM76172(2-[(5Z)-5-[[5-(1,3-benzothiazol-2-yl)-2-furanyl]me...)
Affinity DataEC50: >1.00E+5nM. Assay description: Data Source: Sanford-Burnham Center for Chemical Genomics (SBCCG) Source Affiliation: Sanford-Burnham Medical Research Institute (SBMRI, San Diego, C...
In DepthDetails PCBioAssay
TargetAlkaline phosphatase, germ cell type(Homo sapiens (Human))
Burnham Center For Chemical Genomics
Curated by PubChem BioAssay
LigandPNGBDBM76172(2-[(5Z)-5-[[5-(1,3-benzothiazol-2-yl)-2-furanyl]me...)
Affinity DataEC50:  6.08E+4nM. Assay description: Data Source: Sanford-Burnham Center for Chemical Genomics (SBCCG) Source Affiliation: Sanford-Burnham Medical Research Institute (SBMRI, San Diego, C...
In DepthDetails PCBioAssay
TargetProtein artemis(Homo sapiens (Human))
Burnham Center For Chemical Genomics
Curated by PubChem BioAssay
LigandPNGBDBM76172(2-[(5Z)-5-[[5-(1,3-benzothiazol-2-yl)-2-furanyl]me...)
Affinity DataIC50:  2.00E+4nM. Assay description: Data Source: Sanford-Burnham Center for Chemical Genomics (SBCCG) Source Affiliation: Sanford-Burnham Medical Research Institute (SBMRI, San Diego CA...
In DepthDetails PCBioAssay
TargetIntestinal-type alkaline phosphatase 1(Rattus norvegicus (Rat))
Burnham Center For Chemical Genomics
Curated by PubChem BioAssay
LigandPNGBDBM76172(2-[(5Z)-5-[[5-(1,3-benzothiazol-2-yl)-2-furanyl]me...)
Affinity DataIC50:  1.34E+4nM. Assay description: Data Source: Sanford-Burnham Center for Chemical Genomics (SBCCG) Source Affiliation: Sanford-Burnham Medical Research Institute (SBMRI, San Diego, C...
In DepthDetails PCBioAssay
TargetAlkaline phosphatase, tissue-nonspecific isozyme(Homo sapiens (Human))
Burnham Center For Chemical Genomics
Curated by PubChem BioAssay
LigandPNGBDBM76172(2-[(5Z)-5-[[5-(1,3-benzothiazol-2-yl)-2-furanyl]me...)
Affinity DataIC50:  2.43E+4nM. Assay description: Data Source: Sanford-Burnham Center for Chemical Genomics (SBCCG) Source Affiliation: Sanford-Burnham Medical Research Institute (SBMRI, San Diego, C...
In DepthDetails PCBioAssay