BDBM76183 2,5-dimethyl-N-[4-oxidanyl-3-(1H-1,2,4-triazol-5-ylsulfanyl)phenyl]benzenesulfonamide::MLS000690527::N-[4-hydroxy-3-(1H-1,2,4-triazol-3-ylthio)phenyl]-2,5-dimethylbenzenesulfonamide::N-[4-hydroxy-3-(1H-1,2,4-triazol-5-ylsulfanyl)phenyl]-2,5-dimethylbenzenesulfonamide::N-[4-hydroxy-3-(1H-1,2,4-triazol-5-ylthio)phenyl]-2,5-dimethyl-benzenesulfonamide::N-[4-hydroxy-3-(1H-1,2,4-triazol-5-ylthio)phenyl]-2,5-dimethylbenzenesulfonamide::SMR000300081::cid_2206707
SMILES Cc1ccc(C)c(c1)S(=O)(=O)Nc1ccc(O)c(Sc2nnc[nH]2)c1
InChI Key InChIKey=ZKNMJBZSLDLYAV-UHFFFAOYSA-N
Data  2 IC50  2 EC50
  Tab Delimited (TSV)   2D SDfile   Computed 3D by Vconf -m prep SDfile
Find this compound or compounds like it in BindingDB:
Activity Spreadsheet -- Enzyme Inhibition Constant Data from BindingDB
Found 4 hits for monomerid = 76183
TargetIntestinal-type alkaline phosphatase(Homo sapiens (Human))
Burnham Center For Chemical Genomics
Curated by PubChem BioAssay
LigandPNGBDBM76183(2,5-dimethyl-N-[4-oxidanyl-3-(1H-1,2,4-triazol-5-y...)
Affinity DataEC50:  1.19E+4nM. Assay description: Data Source: Sanford-Burnham Center for Chemical Genomics (SBCCG) Source Affiliation: Sanford-Burnham Medical Research Institute (SBMRI, San Diego, C...
In DepthDetails PCBioAssay
TargetIntestinal-type alkaline phosphatase 1(Rattus norvegicus (Rat))
Burnham Center For Chemical Genomics
Curated by PubChem BioAssay
LigandPNGBDBM76183(2,5-dimethyl-N-[4-oxidanyl-3-(1H-1,2,4-triazol-5-y...)
Affinity DataIC50:  2.75E+3nM. Assay description: Data Source: Sanford-Burnham Center for Chemical Genomics (SBCCG) Source Affiliation: Sanford-Burnham Medical Research Institute (SBMRI, San Diego, C...
In DepthDetails PCBioAssay
TargetAlkaline phosphatase, tissue-nonspecific isozyme(Homo sapiens (Human))
Burnham Center For Chemical Genomics
Curated by PubChem BioAssay
LigandPNGBDBM76183(2,5-dimethyl-N-[4-oxidanyl-3-(1H-1,2,4-triazol-5-y...)
Affinity DataIC50:  5.46E+3nM. Assay description: Data Source: Sanford-Burnham Center for Chemical Genomics (SBCCG) Source Affiliation: Sanford-Burnham Medical Research Institute (SBMRI, San Diego, C...
In DepthDetails PCBioAssay
TargetAlkaline phosphatase, germ cell type(Homo sapiens (Human))
Burnham Center For Chemical Genomics
Curated by PubChem BioAssay
LigandPNGBDBM76183(2,5-dimethyl-N-[4-oxidanyl-3-(1H-1,2,4-triazol-5-y...)
Affinity DataEC50:  1.31E+4nM. Assay description: Data Source: Sanford-Burnham Center for Chemical Genomics (SBCCG) Source Affiliation: Sanford-Burnham Medical Research Institute (SBMRI, San Diego, C...
In DepthDetails PCBioAssay