BDBM76293 MLS001234034::N-[3-(3,5-dimethyl-1-piperidinyl)propyl]-4-hydroxy-9-methyl-2-oxo-3-pyrido[1,2-a]pyrimidinecarboxamide::N-[3-(3,5-dimethylpiperidin-1-yl)propyl]-4-hydroxy-9-methyl-2-oxopyrido[1,2-a]pyrimidine-3-carboxamide::N-[3-(3,5-dimethylpiperidin-1-yl)propyl]-9-methyl-4-oxidanyl-2-oxidanylidene-pyrido[1,2-a]pyrimidine-3-carboxamide::N-[3-(3,5-dimethylpiperidino)propyl]-4-hydroxy-2-keto-9-methyl-pyrido[1,2-a]pyrimidine-3-carboxamide::SMR000811816::cid_18575815
SMILES CC1CC(C)CN(CCCNC(=O)c2c(O)nc3c(C)cccn3c2=O)C1
InChI Key InChIKey=MDDYKHFKAKYZGB-UHFFFAOYSA-N
Data  2 IC50
  Tab Delimited (TSV)   2D SDfile   Computed 3D by Vconf -m prep SDfile
Find this compound or compounds like it in BindingDB:
Activity Spreadsheet -- Enzyme Inhibition Constant Data from BindingDB
Found 2 hits for monomerid = 76293
TargetNACHT, LRR and PYD domains-containing protein 3(Homo sapiens (Human))
Burnham Center For Chemical Genomics
Curated by PubChem BioAssay
LigandPNGBDBM76293(MLS001234034 | N-[3-(3,5-dimethyl-1-piperidinyl)pr...)
Affinity DataIC50:  1.03E+4nM. Assay description: Data Source: Sanford-Burnham Center for Chemical Genomics (SBCCG) Source Affiliation: Sanford-Burnham Medical Research Institute (SBMRI, San Diego, C...
In DepthDetails PCBioAssay
TargetNACHT, LRR and PYD domains-containing protein 3(Homo sapiens (Human))
Burnham Center For Chemical Genomics
Curated by PubChem BioAssay
LigandPNGBDBM76293(MLS001234034 | N-[3-(3,5-dimethyl-1-piperidinyl)pr...)
Affinity DataIC50:  1.49E+4nM. Assay description: Data Source: Sanford-Burnham Center for Chemical Genomics (SBCCG) Source Affiliation: Sanford-Burnham Medical Research Institute (SBMRI, San Diego, C...
In DepthDetails PCBioAssay