BDBM77863 US9695197, 5
SMILES CCNC1=N[C@H]2[C@@H](S1)S[C@H](C(F)F)[C@@H](O)[C@@H]2O
InChI Key InChIKey=XDEJIMDRAROROE-KYGLGHNPSA-N
Data  1 KI  1 EC50
  Tab Delimited (TSV)   2D SDfile   Computed 3D by Vconf -m prep SDfile
Find this compound or compounds like it in BindingDB:
Activity Spreadsheet -- Enzyme Inhibition Constant Data from BindingDB
Found 2 hits for monomerid = 77863
TargetProtein O-GlcNAcase(Homo sapiens (Human))
Alectos Therapeutics
US Patent
LigandPNGBDBM77863(US9695197, 5)
Affinity DataKi:  22nM ΔG°:  -10.4kcal/molepH: 7.0 T: 2°C. Assay description: Enzymatic reactions were carried out in a reaction containing 50 mM NaH2PO4, 100 mM NaCl and 0.1% BSA (pH 7.0) using 2 mM 4-Methylumbelliferyl N-acet...
In DepthDetails US Patent
TargetProtein O-GlcNAcase(Homo sapiens (Human))
Alectos Therapeutics
US Patent
LigandPNGBDBM77863(US9695197, 5)
Affinity DataEC50:  349nMT: 2°C. Assay description: The ELISA portion of the assay is performed in a black Maxisorp 96-well plate that is coated overnight at 4° C. with 100 uL/well of the cell lysa...
In DepthDetails US Patent