BDBM82384 Benzyloxycarbonyl CCK(27-32)NH2
SMILES CSCC[C@H](NC(=O)[C@@H](N)Cc1ccc(OS(O)(=O)=O)cc1)C(=O)NCC(=O)N[C@@H](Cc1c[nH]c2ccccc12)C(=O)N[C@@H](CCSC)C(=O)N[C@@H](CC(O)=O)C(=O)OCc1ccccc1
InChI Key InChIKey=PAFQDWDIHZPRIV-AWSJBNSNSA-N
Data  1 KI
  Tab Delimited (TSV)   2D SDfile   Computed 3D by Vconf -m prep SDfile
Find this compound or compounds like it in BindingDB:
Activity Spreadsheet -- Enzyme Inhibition Constant Data from BindingDB
Found 1 hit for monomerid = 82384
TargetCholecystokinin(RAT)
Merck Sharp & Dohme Research Laboratories
Curated by PDSP Ki Database
LigandPNGBDBM82384(Benzyloxycarbonyl CCK(27-32)NH2)
Affinity DataKi:  3.50E+3nM
In DepthDetails ArticlePubMed