BDBM82410 CAS_50913-82-1::ORG2766::Org 2766
SMILES CCC(N)C(=O)OC(=O)[C@H](C)N(C(=O)[C@@H](CCCCN)NC(=O)[C@@H](N)Cc1ccccc1)C(=O)[C@H](Cc1cnc[nH]1)NC(=O)[C@@H](N)CC(C(O)=O)S(C)(=O)=O
InChI Key InChIKey=AKIIEVUJEXRNKN-SEFDSSNDSA-N
Data  7 KI
  Tab Delimited (TSV)   2D SDfile   Computed 3D by Vconf -m prep SDfile
Find this compound or compounds like it in BindingDB:
Activity Spreadsheet -- Enzyme Inhibition Constant Data from BindingDB
Found 7 hits for monomerid = 82410
TargetMelanocyte-stimulating hormone receptor(Homo sapiens (Human))
Uppsala
Curated by PDSP Ki Database
LigandPNGBDBM82410(CAS_50913-82-1 | ORG2766 | Org 2766)
Affinity DataKi: >1.00E+4nM
Ligand InfoKEGGPC cidPC sid
In DepthDetails ArticlePubMed
TargetMelanocortin receptor 3(Homo sapiens (Human))
Uppsala
Curated by PDSP Ki Database
LigandPNGBDBM82410(CAS_50913-82-1 | ORG2766 | Org 2766)
Affinity DataKi: >1.00E+4nM
Ligand InfoKEGGPC cidPC sid
In DepthDetails ArticlePubMed
TargetMelanocortin receptor 5(Homo sapiens (Human))
Uppsala
Curated by PDSP Ki Database
LigandPNGBDBM82410(CAS_50913-82-1 | ORG2766 | Org 2766)
Affinity DataKi: >1.00E+4nM
Ligand InfoKEGGPC cidPC sid
In DepthDetails ArticlePubMed
TargetMelanocortin receptor 5(Homo sapiens (Human))
Uppsala
Curated by PDSP Ki Database
LigandPNGBDBM82410(CAS_50913-82-1 | ORG2766 | Org 2766)
Affinity DataKi: >1.00E+4nM
Ligand InfoKEGGPC cidPC sid
In DepthDetails ArticlePubMed
TargetMelanocortin receptor 3(Homo sapiens (Human))
Uppsala
Curated by PDSP Ki Database
LigandPNGBDBM82410(CAS_50913-82-1 | ORG2766 | Org 2766)
Affinity DataKi: >1.00E+4nM
Ligand InfoKEGGPC cidPC sid
In DepthDetails ArticlePubMed
TargetMelanocortin receptor 4(Homo sapiens (Human))
Uppsala University
Curated by PDSP Ki Database
LigandPNGBDBM82410(CAS_50913-82-1 | ORG2766 | Org 2766)
Affinity DataKi: >1.00E+4nM
Ligand InfoKEGGPC cidPC sid
In DepthDetails ArticlePubMed
TargetMelanocyte-stimulating hormone receptor(Homo sapiens (Human))
Uppsala
Curated by PDSP Ki Database
LigandPNGBDBM82410(CAS_50913-82-1 | ORG2766 | Org 2766)
Affinity DataKi: >1.00E+4nM
Ligand InfoKEGGPC cidPC sid
In DepthDetails ArticlePubMed