BDBM8319 N-[5-(pyridin-3-yl)-1H-pyrazolo[3,4-b]pyridin-3-yl]butanamide::pyrazolopyridine deriv. 22
SMILES CCCC(=O)Nc1n[nH]c2ncc(cc12)-c1cccnc1
InChI Key InChIKey=SVEYNURJTZJXIG-UHFFFAOYSA-N
Data  2 IC50  1 Other
  Tab Delimited (TSV)   2D SDfile   Computed 3D by Vconf -m prep SDfile
Find this compound or compounds like it in BindingDB:
Activity Spreadsheet -- Enzyme Inhibition Constant Data from BindingDB
Found 3 hits for monomerid = 8319
TargetGlycogen synthase kinase-3 alpha(Homo sapiens (Human))
Glaxosmithkline
LigandPNGBDBM8319(N-[5-(pyridin-3-yl)-1H-pyrazolo[3,4-b]pyridin-3-yl...)
Affinity DataIC50:  11nM. Assay description: The biochemical activity of compounds was determined by incubation with specific enzyme and substrate in the presence 10 uM ATP/ [gamma-33P] ATP. Aft...
In DepthDetails ArticlePubMed
TargetGlycogen synthase kinase-3 beta(Homo sapiens (Human))
University Of Jordan
Curated by ChEMBL
LigandPNGBDBM8319(N-[5-(pyridin-3-yl)-1H-pyrazolo[3,4-b]pyridin-3-yl...)
Affinity DataIC50:  11nM. Assay description: Inhibition of recombinant GSK3-beta
In DepthDetails ArticlePubMed
TargetCyclin-A2/Cyclin-dependent kinase 2(Homo sapiens (Human))
Glaxosmithkline
LigandPNGBDBM8319(N-[5-(pyridin-3-yl)-1H-pyrazolo[3,4-b]pyridin-3-yl...)
Affinity DatapH: 7.5 T: 2°C. Assay description: In vitro kinase assay using purified CDK2/Cyclin A was incubated at room temperature with substrate, and test compounds in the presence of 100 uM ATP...
In DepthDetails ArticlePubMed