BDBM83225 (4Z)-4-[4-(difluoromethoxy)benzylidene]-2-(m-tolyl)isoquinoline-1,3-quinone::(4Z)-4-[[4-(difluoromethoxy)phenyl]methylidene]-2-(3-methylphenyl)isoquinoline-1,3-dione::(4Z)-4-[[4-[bis(fluoranyl)methoxy]phenyl]methylidene]-2-(3-methylphenyl)isoquinoline-1,3-dione::MLS000394574::SMR000262023::cid_2467621
SMILES Cc1cccc(c1)N1C(=O)\C(=C/c2ccc(OC(F)F)cc2)c2ccccc2C1=O
InChI Key InChIKey=WRUTZGXAQVJCAG-STZFKDTASA-N
Data  2 IC50
  Tab Delimited (TSV)   2D SDfile   Computed 3D by Vconf -m prep SDfile
Find this compound or compounds like it in BindingDB:
Activity Spreadsheet -- Enzyme Inhibition Constant Data from BindingDB
Found 2 hits for monomerid = 83225
TargetBeta-lactamase(Pseudomonas aeruginosa)
The Scripps Research Institute Molecular Screening Center
Curated by PubChem BioAssay
LigandPNGBDBM83225((4Z)-4-[4-(difluoromethoxy)benzylidene]-2-(m-tolyl...)
Affinity DataIC50:  3.90E+3nM. Assay description: Source (MLPCN Center Name): The Scripps Research Institute Molecular Screening Center (SRIMSC) Affiliation: The Scripps Research Institute, TSRI Assa...
In DepthDetails PCBioAssay
TargetToll-like receptor 9(Homo sapiens (Human))
The Scripps Research Institute Molecular Screening Center
Curated by PubChem BioAssay
LigandPNGBDBM83225((4Z)-4-[4-(difluoromethoxy)benzylidene]-2-(m-tolyl...)
Affinity DataIC50:  4.95E+3nM. Assay description: Source (MLPCN Center Name): The Scripps Research Institute Molecular Screening Center (SRIMSC) Affiliation: The Scripps Research Institute, TSRI Assa...
In DepthDetails PCBioAssay