BDBM83416 5,6-bis(chloranyl)-N-[2-(dimethylamino)-2-phenyl-ethyl]pyridine-3-carboxamide::5,6-dichloro-N-[2-(dimethylamino)-2-phenyl-ethyl]nicotinamide::5,6-dichloro-N-[2-(dimethylamino)-2-phenylethyl]-3-pyridinecarboxamide::5,6-dichloro-N-[2-(dimethylamino)-2-phenylethyl]pyridine-3-carboxamide::MLS001172392::SMR000589034::cid_3432723
SMILES CN(C)C(CNC(=O)c1cnc(Cl)c(Cl)c1)c1ccccc1
InChI Key InChIKey=AEOFNTZWSKMVEO-UHFFFAOYSA-N
Data  1 EC50
  Tab Delimited (TSV)   2D SDfile   Computed 3D by Vconf -m prep SDfile
Find this compound or compounds like it in BindingDB:
Activity Spreadsheet -- Enzyme Inhibition Constant Data from BindingDB
Found 1 hit for monomerid = 83416
TargetDelta-type opioid receptor(Homo sapiens (Human))
The Scripps Research Institute Molecular Screening Center
Curated by PubChem BioAssay
LigandPNGBDBM83416(5,6-bis(chloranyl)-N-[2-(dimethylamino)-2-phenyl-e...)
Affinity DataEC50:  1.07E+3nM. Assay description: Source (MLPCN Center Name): The Scripps Research Institute Molecular Screening Center (SRIMSC) Affiliation: The Scripps Research Institute, TSRI Assa...
In DepthDetails PCBioAssay