BDBM83572 1-(2-benzoyl-6-hydroxy-3-methyl-1-benzofuran-5-yl)ethanone::1-(2-benzoyl-6-hydroxy-3-methyl-5-benzofuranyl)ethanone::1-(2-benzoyl-6-hydroxy-3-methyl-benzofuran-5-yl)ethanone::1-[3-methyl-6-oxidanyl-2-(phenylcarbonyl)-1-benzofuran-5-yl]ethanone::MLS000704591::SMR000231655::cid_838788
SMILES CC(=O)c1cc2c(C)c(oc2cc1O)C(=O)c1ccccc1
InChI Key InChIKey=PQJFCVNRDWTZGH-UHFFFAOYSA-N
Data  2 EC50
  Tab Delimited (TSV)   2D SDfile   Computed 3D by Vconf -m prep SDfile
Find this compound or compounds like it in BindingDB:
Activity Spreadsheet -- Enzyme Inhibition Constant Data from BindingDB
Found 2 hits for monomerid = 83572
TargetEndoribonuclease toxin MazF(Escherichia coli str. K-12 substr. MG1655)
Burnham Center For Chemical Genomics
Curated by PubChem BioAssay
LigandPNGBDBM83572(1-(2-benzoyl-6-hydroxy-3-methyl-1-benzofuran-5-yl)...)
Affinity DataEC50: >9.90E+4nM. Assay description: Data Source: Sanford-Burnham Center for Chemical Genomics (SBCCG) Source Affiliation: Sanford-Burnham Medical Research Institute (SBMRI, San Diego, C...
In DepthDetails PCBioAssay
TargetEndoribonuclease toxin MazF(Escherichia coli str. K-12 substr. MG1655)
Burnham Center For Chemical Genomics
Curated by PubChem BioAssay
LigandPNGBDBM83572(1-(2-benzoyl-6-hydroxy-3-methyl-1-benzofuran-5-yl)...)
Affinity DataEC50: >9.90E+4nM. Assay description: Data Source: Sanford-Burnham Center for Chemical Genomics (SBCCG) Source Affiliation: Sanford-Burnham Medical Research Institute (SBMRI, San Diego, C...
In DepthDetails PCBioAssay