BDBM84157 4-[(3,4-dimethylphenyl)carbamoyl-(2-methoxyethyl)amino]piperidine-1-carboxylic acid ethyl ester::4-[[(3,4-dimethylanilino)-oxomethyl]-(2-methoxyethyl)amino]-1-piperidinecarboxylic acid ethyl ester::MLS000521076::SMR000131485::cid_9550175::ethyl 4-[(3,4-dimethylphenyl)carbamoyl-(2-methoxyethyl)amino]piperidine-1-carboxylate
SMILES CCOC(=O)N1CCC(CC1)N(CCOC)C(=O)Nc1ccc(C)c(C)c1
InChI Key InChIKey=PGRRWEWSNCBKPD-UHFFFAOYSA-N
Data  1 IC50
  Tab Delimited (TSV)   2D SDfile   Computed 3D by Vconf -m prep SDfile
Find this compound or compounds like it in BindingDB:
Activity Spreadsheet -- Enzyme Inhibition Constant Data from BindingDB
Found 1 hit for monomerid = 84157
TargetPotassium voltage-gated channel subfamily KQT member 2(Rattus norvegicus)
Johns Hopkins Ion Channel Center
Curated by PubChem BioAssay
LigandPNGBDBM84157(4-[(3,4-dimethylphenyl)carbamoyl-(2-methoxyethyl)a...)
Affinity DataIC50:  477nM. Assay description: Source (MLPCN Center Name): Johns Hopkins Ion Channel Center (JHICC_KCNQ2_Inh_HFCP_IWS_CRC) Center Affiliation: Johns Hopkins University, School of M...
Ligand InfoPC cidPC sid
In DepthDetails PCBioAssay