BDBM84158 3-(4-ethylphenyl)-1-(2-furanylmethyl)-1-(1-thiophen-2-ylethyl)urea::3-(4-ethylphenyl)-1-(2-furfuryl)-1-[1-(2-thienyl)ethyl]urea::3-(4-ethylphenyl)-1-(furan-2-ylmethyl)-1-(1-thiophen-2-ylethyl)urea::MLS000521124::SMR000131533::cid_4613736
SMILES CCc1ccc(NC(=O)N(Cc2ccco2)C(C)c2cccs2)cc1
InChI Key InChIKey=UOXPQCRLHSVSMA-UHFFFAOYSA-N
Data  1 IC50
  Tab Delimited (TSV)   2D SDfile   Computed 3D by Vconf -m prep SDfile
Find this compound or compounds like it in BindingDB:
Activity Spreadsheet -- Enzyme Inhibition Constant Data from BindingDB
Found 1 hit for monomerid = 84158
TargetPotassium voltage-gated channel subfamily KQT member 2(Rattus norvegicus)
Johns Hopkins Ion Channel Center
Curated by PubChem BioAssay
LigandPNGBDBM84158(3-(4-ethylphenyl)-1-(2-furanylmethyl)-1-(1-thiophe...)
Affinity DataIC50:  1.04E+3nM. Assay description: Source (MLPCN Center Name): Johns Hopkins Ion Channel Center (JHICC_KCNQ2_Inh_HFCP_IWS_CRC) Center Affiliation: Johns Hopkins University, School of M...
In DepthDetails PCBioAssay