BDBM84165 2-Ethyl-6-fluoro-3-methyl-quinoline-4-carboxylic acid (2-methyl-cyclohexyl)-amide::2-ethyl-6-fluoranyl-3-methyl-N-(2-methylcyclohexyl)quinoline-4-carboxamide::2-ethyl-6-fluoro-3-methyl-N-(2-methylcyclohexyl)-4-quinolinecarboxamide::2-ethyl-6-fluoro-3-methyl-N-(2-methylcyclohexyl)cinchoninamide::2-ethyl-6-fluoro-3-methyl-N-(2-methylcyclohexyl)quinoline-4-carboxamide::MLS000555300::SMR000172732::cid_3184553
SMILES CCc1nc2ccc(F)cc2c(C(=O)NC2CCCCC2C)c1C
InChI Key InChIKey=WEKTWUWLWLMTRG-UHFFFAOYSA-N
Data  1 IC50
  Tab Delimited (TSV)   2D SDfile   Computed 3D by Vconf -m prep SDfile
Find this compound or compounds like it in BindingDB:
Activity Spreadsheet -- Enzyme Inhibition Constant Data from BindingDB
Found 1 hit for monomerid = 84165
TargetPotassium voltage-gated channel subfamily KQT member 2(Rattus norvegicus)
Johns Hopkins Ion Channel Center
Curated by PubChem BioAssay
LigandPNGBDBM84165(2-Ethyl-6-fluoro-3-methyl-quinoline-4-carboxylic a...)
Affinity DataIC50:  636nM. Assay description: Source (MLPCN Center Name): Johns Hopkins Ion Channel Center (JHICC_KCNQ2_Inh_HFCP_IWS_CRC) Center Affiliation: Johns Hopkins University, School of M...
In DepthDetails PCBioAssay