BDBM84177 MLS001171558::N-benzyl-N-methyl-2-(3,4,5-trimethoxyphenyl)cinchoninamide::N-benzyl-N-methyl-2-(3,4,5-trimethoxyphenyl)quinoline-4-carboxamide::N-methyl-N-(phenylmethyl)-2-(3,4,5-trimethoxyphenyl)-4-quinolinecarboxamide::N-methyl-N-(phenylmethyl)-2-(3,4,5-trimethoxyphenyl)quinoline-4-carboxamide::SMR000595156::cid_4796206
SMILES COc1cc(cc(OC)c1OC)-c1cc(C(=O)N(C)Cc2ccccc2)c2ccccc2n1
InChI Key InChIKey=BTQGKLZVCQBANJ-UHFFFAOYSA-N
Data  1 IC50
  Tab Delimited (TSV)   2D SDfile   Computed 3D by Vconf -m prep SDfile
Find this compound or compounds like it in BindingDB:
Activity Spreadsheet -- Enzyme Inhibition Constant Data from BindingDB
Found 1 hit for monomerid = 84177
TargetPotassium voltage-gated channel subfamily KQT member 2(Rattus norvegicus)
Johns Hopkins Ion Channel Center
Curated by PubChem BioAssay
LigandPNGBDBM84177(MLS001171558 | N-benzyl-N-methyl-2-(3,4,5-trimetho...)
Affinity DataIC50:  634nM. Assay description: Source (MLPCN Center Name): Johns Hopkins Ion Channel Center (JHICC_KCNQ2_Inh_HFCP_IWS_CRC) Center Affiliation: Johns Hopkins University, School of M...
In DepthDetails PCBioAssay