BDBM84517 Sulindac analogue, 14
SMILES CC1=C(CC(O)=O)c2cc(F)ccc2\C1=C/c1ccoc1
InChI Key InChIKey=XJUITJZJIVLMIP-NSIKDUERSA-N
Data  1 IC50
  Tab Delimited (TSV)   2D SDfile   Computed 3D by Vconf -m prep SDfile
Find this compound or compounds like it in BindingDB:
Activity Spreadsheet -- Enzyme Inhibition Constant Data from BindingDB
Found 1 hit for monomerid = 84517
TargetVascular endothelial growth factor receptor 2(Homo sapiens (Human))
Max-Planck-Institut FÜR Molekulare Physiologie
LigandPNGBDBM84517(Sulindac analogue, 14)
Affinity DataIC50:  8.00E+3nM. Assay description: The kinase-catalyzed phosphorylation of poly(Glu4-Tyr) in the presence of varying concentrations of inhibitor was determined. The kinase were employ...
In DepthDetails ArticlePubMed