BDBM84526 Sulindac analogue, 23
SMILES CCC1=C(CC(O)=O)c2cc(\C=C\C(=O)OC(C)(C)C)ccc2\C1=C/c1ccsc1
InChI Key InChIKey=ZCJSQTWKPMWGNT-JERDJRHPSA-N
Data  1 IC50
  Tab Delimited (TSV)   2D SDfile   Computed 3D by Vconf -m prep SDfile
Find this compound or compounds like it in BindingDB:
Activity Spreadsheet -- Enzyme Inhibition Constant Data from BindingDB
Found 1 hit for monomerid = 84526
TargetAngiopoietin-1 receptor(Homo sapiens (Human))
Max-Planck-Institut FÜR Molekulare Physiologie
LigandPNGBDBM84526(Sulindac analogue, 23)
Affinity DataIC50:  5.00E+3nM. Assay description: The kinase-catalyzed phosphorylation of poly(Glu4-Tyr) in the presence of varying concentrations of inhibitor was determined. The kinase were employ...
Ligand InfoPC cidPC sid
In DepthDetails ArticlePubMed