BDBM84573 VS-83
SMILES Oc1cccc(c1)C1NC(=S)Nc2cccc(F)c12
InChI Key InChIKey=MAEYCDNDKNPNQJ-UHFFFAOYSA-N
Data  1 IC50
  Tab Delimited (TSV)   2D SDfile   Computed 3D by Vconf -m prep SDfile
Find this compound or compounds like it in BindingDB:
Activity Spreadsheet -- Enzyme Inhibition Constant Data from BindingDB
Found 1 hit for monomerid = 84573
TargetKinesin-like protein KIF11(Homo sapiens (Human))
University of Leipzig
LigandPNGBDBM84573(VS-83)
Affinity DataIC50:  1.17E+3nMpH: 6.8 T: 2°C. Assay description: The ATPase activity of the Eg5 motor domain was measured by using the malachite green assay.
In DepthDetails ArticlePubMed