BDBM84997 NPY D-Trp32::NPY D-Trp32, human, rat::NPY D-Trp32, porcine
SMILES CC[C@H](C)[C@H](NC(=O)[C@H](CC(C)C)NC(=O)[C@H](CC(N)=O)NC(=O)[C@@H](NC(=O)[C@H](Cc1ccc(O)cc1)NC(=O)[C@H](Cc1c[nH]cn1)NC(=O)[C@H](CCCN=C(N)N)NC(=O)[C@H](CC(C)C)NC(=O)[C@H](C)NC(=O)[C@H](CO)NC(=O)[C@H](Cc1ccc(O)cc1)NC(=O)[C@H](Cc1ccc(O)cc1)NC(=O)[C@H](CCCN=C(N)N)NC(=O)[C@H](C)NC(=O)[C@H](CCSC)NC(=O)[C@H](CC(O)=O)NC(=O)[C@H](CCC(O)=O)NC(=O)[C@H](C)NC(=O)[C@@H]1CCCN1C(=O)[C@H](C)NC(=O)[C@H](CC(O)=O)NC(=O)[C@H](CCC(O)=O)NC(=O)CNC(=O)[C@@H]1CCCN1C(=O)[C@H](CC(N)=O)NC(=O)[C@H](CC(O)=O)NC(=O)[C@@H]1CCCN1C(=O)[C@H](CCCCN)NC(=O)[C@H](CO)NC(=O)[C@@H]1CCCN1C(=O)[C@@H](N)Cc1ccc(O)cc1)[C@@H](C)CC)C(=O)N[C@H](CC1CNc2ccccc12)C(=O)N[C@@H](CCCN=C(N)N)C(=O)N[C@@H](CCC(N)=O)C(=O)N[C@@H](CCCN=C(N)N)C(=O)N[C@@H](Cc1ccc(O)cc1)C(N)=O
InChI Key InChIKey=GDCAVPLGBURLHA-WZLVGYRDSA-N
Data  15 KI
  Tab Delimited (TSV)   2D SDfile   Computed 3D by Vconf -m prep SDfile
Find this compound or compounds like it in BindingDB:
Activity Spreadsheet -- Enzyme Inhibition Constant Data from BindingDB
Found 2 hits for monomerid = 84997
TargetNeuropeptide Y receptor type 1(GUINEA PIG)
Uppsala University
Curated by PDSP Ki Database
LigandPNGBDBM84997(NPY D-Trp32 | NPY D-Trp32, human, rat | NPY D-Trp3...)
Affinity DataKi:  1.00E+3nM
In DepthDetails ArticlePubMed
TargetNeuropeptide Y receptor type 1(RAT)
Uppsala University
Curated by PDSP Ki Database
LigandPNGBDBM84997(NPY D-Trp32 | NPY D-Trp32, human, rat | NPY D-Trp3...)
Affinity DataKi:  1.00E+3nM
In DepthDetails ArticlePubMed