BDBM85252 2,4-Trans-4'-hydroxy-4-imidazolyl-7-methoxyflavan, 3d
SMILES COc1ccc2C(CC(Oc2c1)c1ccc(O)cc1)n1ccnc1
InChI Key InChIKey=IXGZSUBGCCMHJQ-UHFFFAOYSA-N
Data  1 IC50
  Tab Delimited (TSV)   2D SDfile   Computed 3D by Vconf -m prep SDfile
Find this compound or compounds like it in BindingDB:
Activity Spreadsheet -- Enzyme Inhibition Constant Data from BindingDB
Found 1 hit for monomerid = 85252
TargetAromatase [1-48](Homo sapiens (Human))
BiomolÉCules Et Cibles Cellulaires Tumorales
LigandPNGBDBM85252(2,4-Trans-4'-hydroxy-4-imidazolyl-7-methoxyfla...)
Affinity DataIC50:  40nM. Assay description: The inhibitory activities of the compounds toward aromatase were determined in vitro using human placental microsomes and [1,2,6,7-3H]-androstenedion...
In DepthDetails ArticlePubMed