BDBM85358 N-[(1H-Indol-2-yl)alkyl]acylamino Derivatives 5c
SMILES COc1cccc2cc(CCNC(C)=O)nc12
InChI Key
Data  1 KI
  Tab Delimited (TSV)   2D SDfile   Computed 3D by Vconf -m prep SDfile
Find this compound or compounds like it in BindingDB:
Activity Spreadsheet -- Enzyme Inhibition Constant Data from BindingDB
Found 1 hit for monomerid = 85358
TargetMelatonin receptor type 1A(Homo sapiens (Human))
Universita Degli Studi Di Milano
Curated by PDSP Ki Database
LigandPNGBDBM85358(N-[(1H-Indol-2-yl)alkyl]acylamino Derivatives 5c)
Affinity DataKi:  3.80E+3nM
In DepthDetails ArticlePubMed