BDBM85363 N-[(1H-Indol-2-yl)alkyl]acylamino Derivatives 8
SMILES COc1cccc2[nH]c(CNC(C)=O)cc12
InChI Key InChIKey=CGDCGWOJLFRNME-UHFFFAOYSA-N
Data  3 KI
  Tab Delimited (TSV)   2D SDfile   Computed 3D by Vconf -m prep SDfile
Find this compound or compounds like it in BindingDB:
Activity Spreadsheet -- Enzyme Inhibition Constant Data from BindingDB
Found 3 hits for monomerid = 85363
TargetMelatonin receptor type 1B(Homo sapiens (Human))
Universit£
Curated by ChEMBL
LigandPNGBDBM85363(N-[(1H-Indol-2-yl)alkyl]acylamino Derivatives 8)
Affinity DataKi:  813nM. Assay description: Binding affinity towards melatonin receptor type 1B stably expressed in NIH3T3 rat fibroblast cells using 2-[125I]iodomelatonin
In DepthDetails ArticlePubMed
TargetMelatonin receptor type 1A(Homo sapiens (Human))
Universit£
Curated by ChEMBL
LigandPNGBDBM85363(N-[(1H-Indol-2-yl)alkyl]acylamino Derivatives 8)
Affinity DataKi:  1.23E+3nM. Assay description: Binding affinity towards melatonin receptor type 1A stably expressed in NIH3T3 rat fibroblast cells using 2-[125I]iodomelatonin (100 pM) as radioliga...
In DepthDetails ArticlePubMed
TargetMelatonin receptor type 1A(Homo sapiens (Human))
Universit£
Curated by ChEMBL
LigandPNGBDBM85363(N-[(1H-Indol-2-yl)alkyl]acylamino Derivatives 8)
Affinity DataKi:  1.23E+3nM
In DepthDetails ArticlePubMed