BDBM86680 CAS_4042::Mpa::NSC_4042
SMILES CC1CC2C3CCC(OC(C)=O)(C(C)=O)C3(C)CCC2C2(C)CCC(=O)C=C12
InChI Key InChIKey=PSGAAPLEWMOORI-UHFFFAOYSA-N
Data  4 KI
  Tab Delimited (TSV)   2D SDfile   Computed 3D by Vconf -m prep SDfile
Find this compound or compounds like it in BindingDB:
Activity Spreadsheet -- Enzyme Inhibition Constant Data from BindingDB
Found 4 hits for monomerid = 86680
TargetProgesterone receptor(Homo sapiens (Human))
Meiji Seika Kaisha
Curated by PDSP Ki Database
LigandPNGBDBM86680(CAS_4042 | Mpa | NSC_4042)
Affinity DataKi:  13nM
In DepthDetails ArticlePubMed
TargetAndrogen receptor(Rattus norvegicus (Rat))
Meiji Seika Kaisha
Curated by PDSP Ki Database
LigandPNGBDBM86680(CAS_4042 | Mpa | NSC_4042)
Affinity DataKi:  19nM
In DepthDetails ArticlePubMed
TargetGlucocorticoid receptor(Homo sapiens (Human))
Meiji Seika Kaisha
Curated by PDSP Ki Database
LigandPNGBDBM86680(CAS_4042 | Mpa | NSC_4042)
Affinity DataKi:  43nM
In DepthDetails ArticlePubMed
TargetEstrogen receptor(Homo sapiens (Human))
Meiji Seika Kaisha
Curated by PDSP Ki Database
LigandPNGBDBM86680(CAS_4042 | Mpa | NSC_4042)
Affinity DataKi: >1.00E+4nM
In DepthDetails ArticlePubMed