BDBM87634 4-amino-N-[2-(4-methoxyphenyl)ethyl]-3-methyl-2-sulfanylidene-1,3-thiazole-5-carboxamide::4-amino-N-[2-(4-methoxyphenyl)ethyl]-3-methyl-2-sulfanylidene-5-thiazolecarboxamide::4-amino-N-[2-(4-methoxyphenyl)ethyl]-3-methyl-2-thioxo-4-thiazoline-5-carboxamide::4-azanyl-N-[2-(4-methoxyphenyl)ethyl]-3-methyl-2-sulfanylidene-1,3-thiazole-5-carboxamide::MLS000083483::SMR000047083::cid_665752
SMILES COc1ccc(CCNC(=O)c2sc(=S)n(C)c2N)cc1
InChI Key InChIKey=ZZFFPSIOODLYOM-UHFFFAOYSA-N
Data  2 IC50
  Tab Delimited (TSV)   2D SDfile   Computed 3D by Vconf -m prep SDfile
Find this compound or compounds like it in BindingDB:
Activity Spreadsheet -- Enzyme Inhibition Constant Data from BindingDB
Found 2 hits for monomerid = 87634
TargetPolyadenylate-binding protein 1(Homo sapiens (Human))
Burnham Center For Chemical Genomics
Curated by PubChem BioAssay
LigandPNGBDBM87634(4-amino-N-[2-(4-methoxyphenyl)ethyl]-3-methyl-2-su...)
Affinity DataIC50: >6.60E+4nM. Assay description: Data Source: Sanford-Burnham Center for Chemical Genomics (SBCCG) Source Affiliation: Sanford-Burnham Medical Research Institute (SBMRI, San Diego, C...
In DepthDetails PCBioAssay
TargetPolyadenylate-binding protein 1(Homo sapiens (Human))
Burnham Center For Chemical Genomics
Curated by PubChem BioAssay
LigandPNGBDBM87634(4-amino-N-[2-(4-methoxyphenyl)ethyl]-3-methyl-2-su...)
Affinity DataIC50: >6.60E+4nM. Assay description: Data Source: Sanford-Burnham Center for Chemical Genomics (SBCCG) Source Affiliation: Sanford-Burnham Medical Research Institute (SBMRI, San Diego, C...
In DepthDetails PCBioAssay