BDBM88563 US10189794, Compound I-5::US10618902, Compound I-5::US10774052, Compound I-5::US9695132, I-5
SMILES COc1cc(OC)cc(c1)N1Cc2cnc(Nc3ccccc3NC(=O)C=C)nc2N(C)C1=O
InChI Key InChIKey=PDJBNXUARHNXQY-UHFFFAOYSA-N
Data  4 IC50
  Tab Delimited (TSV)   2D SDfile   Computed 3D by Vconf -m prep SDfile
Find this compound or compounds like it in BindingDB:
Activity Spreadsheet -- Enzyme Inhibition Constant Data from BindingDB
Found 1 hit for monomerid = 88563
TargetFibroblast growth factor receptor 4(Homo sapiens (Human))
Celgene Car
US Patent
LigandPNGBDBM88563(US10189794, Compound I-5 | US10618902, Compound I-...)
Affinity DataIC50: <100nM. Assay description: For MDA-MB-453 cells signaling, cells were grown in 96-well poly-D-lysine plates (BD Bioscience, San Jose, Calif.) to 90% confluence, and were then i...
In DepthDetails US Patent