BDBM89054 2-(2-chlorophenoxy)acetic acid [(Z)-[1-amino-2-(4-chlorophenyl)ethylidene]amino] ester::MLS-0454723.0001::[(Z)-[1-amino-2-(4-chlorophenyl)ethylidene]amino] 2-(2-chlorophenoxy)acetate::[(Z)-[1-azanyl-2-(4-chlorophenyl)ethylidene]amino] 2-(2-chloranylphenoxy)ethanoate::cid_5343255
SMILES Clc1ccc(CC(=N)NOC(=O)COc2ccccc2Cl)cc1
InChI Key InChIKey=AXIXRPKACAXTLS-UHFFFAOYSA-N
Data  3 IC50
  Tab Delimited (TSV)   2D SDfile   Computed 3D by Vconf -m prep SDfile
Find this compound or compounds like it in BindingDB:
Activity Spreadsheet -- Enzyme Inhibition Constant Data from BindingDB
Found 3 hits for monomerid = 89054
TargetMitochondrial import inner membrane translocase subunit TIM23(Saccharomyces cerevisiae S288c)
Burnham Center For Chemical Genomics
Curated by PubChem BioAssay
LigandPNGBDBM89054(2-(2-chlorophenoxy)acetic acid [(Z)-[1-amino-2-(4-...)
Affinity DataIC50:  4.54E+3nM. Assay description: Data Source: Sanford-Burnham Center for Chemical Genomics (SBCCG) Source Affiliation: Sanford-Burnham Medical Research Institute(SBMRI, San Diego, CA...
In DepthDetails PCBioAssay
TargetMitochondrial import inner membrane translocase subunit TIM10(Saccharomyces cerevisiae S288c)
Burnham Center For Chemical Genomics
Curated by PubChem BioAssay
LigandPNGBDBM89054(2-(2-chlorophenoxy)acetic acid [(Z)-[1-amino-2-(4-...)
Affinity DataIC50:  4.07E+4nM. Assay description: Data Source: Sanford-Burnham Center for Chemical Genomics (SBCCG) Source Affiliation: Sanford-Burnham Medical Research Institute(SBMRI, San Diego, CA...
In DepthDetails PCBioAssay
TargetMitochondrial import inner membrane translocase subunit TIM10(Saccharomyces cerevisiae S288c)
Burnham Center For Chemical Genomics
Curated by PubChem BioAssay
LigandPNGBDBM89054(2-(2-chlorophenoxy)acetic acid [(Z)-[1-amino-2-(4-...)
Affinity DataIC50:  2.71E+4nM. Assay description: Data Source: Sanford-Burnham Center for Chemical Genomics (SBCCG) Source Affiliation: Sanford-Burnham Medical Research Institute(SBMRI, San Diego, CA...
In DepthDetails PCBioAssay