BDBM89352 (2S,4R)-4-cyclohexyl-2-(4-hydroxybutoxy)-N-phenyl-3,4-dihydro-2H-pyran-6-carboxamide::(2S,4R)-4-cyclohexyl-2-(4-oxidanylbutoxy)-N-phenyl-3,4-dihydro-2H-pyran-6-carboxamide::MLS000766524::SMR000441990::cid_16197098
SMILES OCCCCO[C@@H]1C[C@@H](C=C(O1)C(=O)Nc1ccccc1)C1CCCCC1
InChI Key InChIKey=NKNQWGRORJPXNZ-NQIIRXRSSA-N
Data  2 IC50
  Tab Delimited (TSV)   2D SDfile   Computed 3D by Vconf -m prep SDfile
Find this compound or compounds like it in BindingDB:
Activity Spreadsheet -- Enzyme Inhibition Constant Data from BindingDB
Found 2 hits for monomerid = 89352
TargetProtein Wnt-3a(Mus musculus)
Burnham Center For Chemical Genomics
Curated by PubChem BioAssay
LigandPNGBDBM89352((2S,4R)-4-cyclohexyl-2-(4-hydroxybutoxy)-N-phenyl-...)
Affinity DataIC50:  4.77E+4nM
In DepthDetails PCBioAssay
TargetZinc finger protein GLI1(Mus musculus)
Burnham Center For Chemical Genomics
Curated by PubChem BioAssay
LigandPNGBDBM89352((2S,4R)-4-cyclohexyl-2-(4-hydroxybutoxy)-N-phenyl-...)
Affinity DataIC50:  1.96E+3nM. Assay description: Data Source: Sanford-Burnham Center for Chemical Genomics (SBCCG) Source Affiliation: Sanford-Burnham Medical Research Institute (SBMRI, San Diego, C...
In DepthDetails PCBioAssay