BDBM91682 US9695132, I-62
SMILES COc1cc(OC)c(Cl)c(N2Cc3cnc(Nc4ccc(cc4NC(=O)C=C)N4CCC(CC4)C(=O)OC(C)(C)C)nc3N(C)C2=O)c1Cl
InChI Key InChIKey=ZKJZTRAONUBROY-UHFFFAOYSA-N
Data  1 IC50
  Tab Delimited (TSV)   2D SDfile   Computed 3D by Vconf -m prep SDfile
Find this compound or compounds like it in BindingDB:
Activity Spreadsheet -- Enzyme Inhibition Constant Data from BindingDB
Found 1 hit for monomerid = 91682
TargetFibroblast growth factor receptor 4(Homo sapiens (Human))
Celgene Car
US Patent
LigandPNGBDBM91682(US9695132, I-62)
Affinity DataIC50: <100nMpH: 7.5Assay Description:Omnia Assay Protocol for Potency Assessment Against FGFR 4 Enzyme. a) [FGFR4-WT]=10 nM, [ATP]=300 uM, [Y10-Sox]=10 uM (ATP KMapp 300 uM): A 10x stock...
In DepthDetails US Patent