BDBM92558 Neoflavonoid, 10
SMILES COc1ccc2C(CC(=O)Oc2c1)c1cc(OC)c(OC)c(OC)c1
InChI Key InChIKey=PRCIEPQIRAKFCU-UHFFFAOYSA-N
Data  1 KI
  Tab Delimited (TSV)   2D SDfile   Computed 3D by Vconf -m prep SDfile
Find this compound or compounds like it in BindingDB:
Activity Spreadsheet -- Enzyme Inhibition Constant Data from BindingDB
Found 1 hit for monomerid = 92558
TargetAromatase(Homo sapiens (Human))
Central Institute Of Medicinal And Aromatic Plants
LigandPNGBDBM92558(Neoflavonoid, 10)
Affinity DataKi:  0.00838nM. Assay description: Inhibition assay using aromatase enzyme.
In DepthDetails ArticlePubMed