BDBM92835 Bisanilinopyrimidine, 9h::US9249124, 51
SMILES Clc1ccccc1Nc1ccnc(Nc2ccc(cc2)N2CCOCC2)n1
InChI Key InChIKey=SWLCIRDDAOKOHP-UHFFFAOYSA-N
Data  4 IC50
  Tab Delimited (TSV)   2D SDfile   Computed 3D by Vconf -m prep SDfile
Find this compound or compounds like it in BindingDB:
Activity Spreadsheet -- Enzyme Inhibition Constant Data from BindingDB
Found 4 hits for monomerid = 92835
TargetAurora kinase A(Homo sapiens (Human))
Moffitt Cancer Center
LigandPNGBDBM92835(Bisanilinopyrimidine, 9h | US9249124, 51)
Affinity DataIC50:  27nM. Assay description: In vitro enzyme activity assay using Aurora Kinase A.
In DepthDetails ArticlePubMed
TargetAurora kinase A(Homo sapiens (Human))
Moffitt Cancer Center
LigandPNGBDBM92835(Bisanilinopyrimidine, 9h | US9249124, 51)
Affinity DataIC50: <1nMT: 2°C. Assay description: Specifically, MDA-MB-468 cells (American Type Culture Collection) were maintained in Dulbecco's modified Eagle's medium (DMEM) plus 10% fetus bovine ...
In DepthDetails US Patent
TargetAurora kinase A(Homo sapiens (Human))
Moffitt Cancer Center
LigandPNGBDBM92835(Bisanilinopyrimidine, 9h | US9249124, 51)
Affinity DataIC50:  27nMpH: 7.4 T: 2°C. Assay description: Reactions were carried out at room temperature in 15 mM HEPES buffer (pH 7.4) containing 20 mM NaCl, 1 mM EGTA, 0.02% Tween 20, 10 mM MgCl2, 5% (v/v)...
In DepthDetails US Patent
TargetAurora kinase B(Homo sapiens (Human))
Moffitt Cancer Center
LigandPNGBDBM92835(Bisanilinopyrimidine, 9h | US9249124, 51)
Affinity DataIC50:  194nM. Assay description: In vitro enzyme activity assay using Aurora Kinase A.
In DepthDetails ArticlePubMed