BDBM92836 Bisanilinopyrimidine, 6p::US9249124, 52
SMILES NC(=O)c1ccc(Nc2nccc(Nc3ccccc3Cl)n2)cc1
InChI Key InChIKey=DKZGAIQFKXCKMJ-UHFFFAOYSA-N
Data  4 IC50
  Tab Delimited (TSV)   2D SDfile   Computed 3D by Vconf -m prep SDfile
Find this compound or compounds like it in BindingDB:
Activity Spreadsheet -- Enzyme Inhibition Constant Data from BindingDB
Found 4 hits for monomerid = 92836
TargetAurora kinase B(Homo sapiens (Human))
Moffitt Cancer Center
LigandPNGBDBM92836(Bisanilinopyrimidine, 6p | US9249124, 52)
Affinity DataIC50:  50.2nM. Assay description: In vitro enzyme activity assay using Aurora Kinase A.
In DepthDetails ArticlePubMed
TargetAurora kinase A(Homo sapiens (Human))
H. Lee Moffitt Cancer Center and Research Institute
US Patent
LigandPNGBDBM92836(Bisanilinopyrimidine, 6p | US9249124, 52)
Affinity DataIC50: <1nMT: 2°C. Assay description: Specifically, MDA-MB-468 cells (American Type Culture Collection) were maintained in Dulbecco's modified Eagle's medium (DMEM) plus 10% fetus bovine ...
In DepthDetails US Patent
TargetAurora kinase A(Homo sapiens (Human))
H. Lee Moffitt Cancer Center and Research Institute
US Patent
LigandPNGBDBM92836(Bisanilinopyrimidine, 6p | US9249124, 52)
Affinity DataIC50:  30.2nMpH: 7.4 T: 2°C. Assay description: Reactions were carried out at room temperature in 15 mM HEPES buffer (pH 7.4) containing 20 mM NaCl, 1 mM EGTA, 0.02% Tween 20, 10 mM MgCl2, 5% (v/v)...
In DepthDetails US Patent
TargetAurora kinase A(Homo sapiens (Human))
H. Lee Moffitt Cancer Center and Research Institute
US Patent
LigandPNGBDBM92836(Bisanilinopyrimidine, 6p | US9249124, 52)
Affinity DataIC50:  30.2nM. Assay description: In vitro enzyme activity assay using Aurora Kinase A.
In DepthDetails ArticlePubMed