BDBM93475 2-benzyl-N-[2-methyl-4-(4-methylpiperazin-1-yl)phenyl]-3,4-dihydro-1H-benzo[b][1,6]naphthyridine-10-carboxamide::2-benzyl-N-[2-methyl-4-(4-methylpiperazino)phenyl]-3,4-dihydro-1H-benzo[b][1,6]naphthyridine-10-carboxamide::MLS001007077::N-[2-methyl-4-(4-methyl-1-piperazinyl)phenyl]-2-(phenylmethyl)-3,4-dihydro-1H-benzo[b][1,6]naphthyridine-10-carboxamide::N-[2-methyl-4-(4-methylpiperazin-1-yl)phenyl]-2-(phenylmethyl)-3,4-dihydro-1H-benzo[b][1,6]naphthyridine-10-carboxamide::SMR000384510::cid_2557808
SMILES CN1CCN(CC1)c1ccc(NC(=O)c2c3CN(Cc4ccccc4)CCc3nc3ccccc23)c(C)c1
InChI Key InChIKey=FJZHGDHTWMAUJR-UHFFFAOYSA-N
Data  2 IC50
  Tab Delimited (TSV)   2D SDfile   Computed 3D by Vconf -m prep SDfile
Find this compound or compounds like it in BindingDB:
Activity Spreadsheet -- Enzyme Inhibition Constant Data from BindingDB
Found 2 hits for monomerid = 93475
TargetReceptor-interacting serine/threonine-protein kinase 2(Homo sapiens (Human))
The Scripps Research Institute Molecular Screening Center
Curated by PubChem BioAssay
LigandPNGBDBM93475(2-benzyl-N-[2-methyl-4-(4-methylpiperazin-1-yl)phe...)
Affinity DataIC50:  1.10E+4nM
In DepthDetails PCBioAssay
TargetBeta-lactamase(Pseudomonas aeruginosa)
The Scripps Research Institute Molecular Screening Center
Curated by PubChem BioAssay
LigandPNGBDBM93475(2-benzyl-N-[2-methyl-4-(4-methylpiperazin-1-yl)phe...)
Affinity DataIC50:  1.23E+4nM
In DepthDetails PCBioAssay