BDBM93486 5-chloranyl-2-[(3-methylphenyl)methylsulfonyl]-N-(phenylmethyl)pyrimidine-4-carboxamide::5-chloro-2-[(3-methylphenyl)methylsulfonyl]-N-(phenylmethyl)-4-pyrimidinecarboxamide::MLS001116188::N-benzyl-5-chloro-2-(3-methylbenzyl)sulfonyl-pyrimidine-4-carboxamide::N-benzyl-5-chloro-2-[(3-methylphenyl)methylsulfonyl]pyrimidine-4-carboxamide::SMR000625793::cid_16014472
SMILES Cc1cccc(CS(=O)(=O)c2ncc(Cl)c(n2)C(=O)NCc2ccccc2)c1
InChI Key InChIKey=XSEAPCYEIZZORP-UHFFFAOYSA-N
Data  2 IC50
  Tab Delimited (TSV)   2D SDfile   Computed 3D by Vconf -m prep SDfile
Find this compound or compounds like it in BindingDB:
Activity Spreadsheet -- Enzyme Inhibition Constant Data from BindingDB
Found 2 hits for monomerid = 93486
TargetReceptor-interacting serine/threonine-protein kinase 2(Homo sapiens (Human))
The Scripps Research Institute Molecular Screening Center
Curated by PubChem BioAssay
LigandPNGBDBM93486(5-chloranyl-2-[(3-methylphenyl)methylsulfonyl]-N-(...)
Affinity DataIC50:  2.77E+3nM
In DepthDetails PCBioAssay
TargetBeta-lactamase(Pseudomonas aeruginosa)
The Scripps Research Institute Molecular Screening Center
Curated by PubChem BioAssay
LigandPNGBDBM93486(5-chloranyl-2-[(3-methylphenyl)methylsulfonyl]-N-(...)
Affinity DataIC50:  1.23E+4nM
In DepthDetails PCBioAssay